JavaScript for WordPress Forums Bugs & Issues Bugs when I install npm

This topic contains 1 reply, has 2 voices, and was last updated by  Zac Gordon 2 weeks, 2 days ago.

Viewing 2 posts - 1 through 2 (of 2 total)
  • Author
    Posts
  • #114974

    Frank Los
    Participant

    In the course development blogs for Gutenberg.
    The files: https://github.com/zgordon/gutenberg-course/tree/v2
    These errors:

    oBoolean’: was declared deprecated (compiling source file ..
    \src\sass_types\null.cpp) [G:\Users\Frank\Documenten\Website
    s\www.gutenberg-theme.dev.cc\wp-content\plugins\jsforwp-exam
    ple-blocks\node_modules\node-sass\build\binding.vcxproj]
    g:\users\frank\documenten\websites\www.gutenberg-theme.dev
    .cc\wp-content\plugins\jsforwp-example-blocks\node_modules\n
    an\nan_converters_43_inl.h(40): warning C4996: ‘v8::Value::B
    ooleanValue’: was declared deprecated (compiling source file
    ..\src\sass_types\map.cpp) [G:\Users\Frank\Documenten\Websi
    tes\www.gutenberg-theme.dev.cc\wp-content\plugins\jsforwp-ex
    ample-blocks\node_modules\node-sass\build\binding.vcxproj]
    g:\users\frank\documenten\websites\www.gutenberg-theme.dev
    .cc\wp-content\plugins\jsforwp-example-blocks\node_modules\n
    an\nan_converters_43_inl.h(40): warning C4996: ‘v8::Value::B
    ooleanValue’: was declared deprecated (compiling source file
    ..\src\sass_types\null.cpp) [G:\Users\Frank\Documenten\Webs
    ites\www.gutenberg-theme.dev.cc\wp-content\plugins\jsforwp-e
    xample-blocks\node_modules\node-sass\build\binding.vcxproj]
    g:\users\frank\documenten\websites\www.gutenberg-theme.dev
    .cc\wp-content\plugins\jsforwp-example-blocks\node_modules\n
    an\nan_converters_43_inl.h(22): warning C4996: ‘v8::Value::T
    oBoolean’: was declared deprecated (compiling source file ..
    \src\sass_types\number.cpp)g:\users\frank\documenten\website
    s\www.gutenberg-theme.dev.cc\wp-content\plugins\jsforwp-exam
    ple-blocks\node_modules\nan\nan_implementation_12_inl.h(337)
    : error C2059: syntax error: ‘)’ (compiling source file ..\s
    rc\sass_types\null.cpp) [G:\Users\Frank\Documenten\Websites\
    http://www.gutenberg-theme.dev.cc\wp-content\plugins\jsforwp-exampl
    e-blocks\node_modules\node-sass\build\binding.vcxproj]
    g:\users\frank\documenten\websites\www.gutenberg-theme.dev
    .cc\wp-content\plugins\jsforwp-example-blocks\node_modules\n
    an\nan_converters_43_inl.h(40): warning C4996: ‘v8::Value::B
    ooleanValue’: was declared deprecated (compiling source file
    ..\src\sass_types\number.cpp)g:\users\frank\documenten\webs
    ites\www.gutenberg-theme.dev.cc\wp-content\plugins\jsforwp-e
    xample-blocks\node_modules\nan\nan.h(1034): error C2661: ‘v8
    ::Value::ToString’: no overloaded function takes 0 arguments
    (compiling source file ..\src\sass_types\map.cpp) [G:\Users
    \Frank\Documenten\Websites\www.gutenberg-theme.dev.cc\wp-con
    tent\plugins\jsforwp-example-blocks\node_modules\node-sass\b
    uild\binding.vcxproj]
    g:\users\frank\documenten\websites\www.gutenberg-theme.dev
    .cc\wp-content\plugins\jsforwp-example-blocks\node_modules\n
    an\nan.h(1818): warning C4996: ‘v8::Object::Set’: was declar
    ed deprecated (compiling source file ..\src\sass_types\map.c
    pp) [G:\Users\Frank\Documenten\Websites\www.gutenberg-theme.
    dev.cc\wp-content\plugins\jsforwp-example-blocks\node_module
    s\node-sass\build\binding.vcxproj]
    g:\users\frank\documenten\websites\www.gutenberg-theme.dev
    .cc\wp-content\plugins\jsforwp-example-blocks\node_modules\n
    an\nan.h(1824): warning C4996: ‘v8::Object::Set’: was declar
    ed deprecated (compiling source file ..\src\sass_types\map.c
    pp) [G:\Users\Frank\Documenten\Websites\www.gutenberg-theme.
    dev.cc\wp-content\plugins\jsforwp-example-blocks\node_module
    s\node-sass\build\binding.vcxproj]
    g:\users\frank\documenten\websites\www.gutenberg-theme.dev
    .cc\wp-content\plugins\jsforwp-example-blocks\node_modules\n
    an\nan.h(1830): warning C4996: ‘v8::Object::Set’: was declar
    ed deprecated (compiling source file ..\src\sass_types\map.c
    pp)g:\users\frank\documenten\websites\www.gutenberg-theme.de
    v.cc\wp-content\plugins\jsforwp-example-blocks\node_modules\
    nan\nan.h(1044): error C2664: ‘int v8::String::WriteUtf8(v8:
    :Isolate *,char *,int,int *,int) const’: cannot convert argu
    ment 1 from ‘char *’ to ‘v8::Isolate *’ (compiling source fi
    le ..\src\sass_types\null.cpp) [G:\Users\Frank\Documenten\We
    bsites\www.gutenberg-theme.dev.cc\wp-content\plugins\jsforwp
    -example-blocks\node_modules\node-sass\build\binding.vcxproj
    ]
    g:\users\frank\documenten\websites\www.gutenberg-theme.dev
    .cc\wp-content\plugins\jsforwp-example-blocks\node_modules\n
    an\nan.h(1836): warning C4996: ‘v8::Object::Get’: was declar
    ed deprecated (compiling source file ..\src\sass_types\map.c
    pp) [G:\Users\Frank\Documenten\Websites\www.gutenberg-theme.
    dev.cc\wp-content\plugins\jsforwp-example-blocks\node_module
    s\node-sass\build\binding.vcxproj]
    g:\users\frank\documenten\websites\www.gutenberg-theme.dev
    .cc\wp-content\plugins\jsforwp-example-blocks\node_modules\n
    an\nan.h(1842): warning C4996: ‘v8::Object::Get’: was declar
    ed deprecated (compiling source file ..\src\sass_types\map.c
    pp) [G:\Users\Frank\Documenten\Websites\www.gutenberg-theme.
    dev.cc\wp-content\plugins\jsforwp-example-blocks\node_module
    s\node-sass\build\binding.vcxproj]
    g:\users\frank\documenten\websites\www.gutenberg-theme.dev
    .cc\wp-content\plugins\jsforwp-example-blocks\node_modules\n
    an\nan.h(1847): warning C4996: ‘v8::Object::Get’: was declar
    ed deprecated (compiling source file ..\src\sass_types\map.c
    pp) [G:\Users\Frank\Documenten\Websites\www.gutenberg-theme.
    dev.cc\wp-content\plugins\jsforwp-example-blocks\node_module
    s\node-sass\build\binding.vcxproj]
    g:\users\frank\documenten\websites\www.gutenberg-theme.dev
    .cc\wp-content\plugins\jsforwp-example-blocks\node_modules\n
    an\nan.h(1818): warning C4996: ‘v8::Object::Set’: was declar
    ed deprecated (compiling source file ..\src\sass_types\null.
    cpp) [G:\Users\Frank\Documenten\Websites\www.gutenberg-theme
    .dev.cc\wp-content\plugins\jsforwp-example-blocks\node_modul
    es\node-sass\build\binding.vcxproj]
    g:\users\frank\documenten\websites\www.gutenberg-theme.dev
    .cc\wp-content\plugins\jsforwp-example-blocks\node_modules\n
    an\nan.h(1824): warning C4996: ‘v8::Object::Set’: was declar
    ed deprecated (compiling source file ..\src\sass_types\null.
    cpp) [G:\Users\Frank\Documenten\Websites\www.gutenberg-theme
    .dev.cc\wp-content\plugins\jsforwp-example-blocks\node_modul
    es\node-sass\build\binding.vcxproj]
    g:\users\frank\documenten\websites\www.gutenberg-theme.dev
    .cc\wp-content\plugins\jsforwp-example-blocks\node_modules\n
    an\nan.h(1830): warning C4996: ‘v8::Object::Set’: was declar
    ed deprecated (compiling source file ..\src\sass_types\null.
    cpp) [G:\Users\Frank\Documenten\Websites\www.gutenberg-theme
    .dev.cc\wp-content\plugins\jsforwp-example-blocks\node_modul
    es\node-sass\build\binding.vcxproj]
    g:\users\frank\documenten\websites\www.gutenberg-theme.dev
    .cc\wp-content\plugins\jsforwp-example-blocks\node_modules\n
    an\nan.h(1836): warning C4996: ‘v8::Object::Get’: was declar
    ed deprecated (compiling source file ..\src\sass_types\null.
    cpp) [G:\Users\Frank\Documenten\Websites\www.gutenberg-theme
    .dev.cc\wp-content\plugins\jsforwp-example-blocks\node_modul
    es\node-sass\build\binding.vcxproj]
    g:\users\frank\documenten\websites\www.gutenberg-theme.dev
    .cc\wp-content\plugins\jsforwp-example-blocks\node_modules\n
    an\nan.h(1842): warning C4996: ‘v8::Object::Get’: was declar
    ed deprecated (compiling source file ..\src\sass_types\null.
    cpp)g:\users\frank\documenten\websites\www.gutenberg-theme.d
    ev.cc\wp-content\plugins\jsforwp-example-blocks\node_modules
    \nan\nan.h(1034): error C2661: ‘v8::Value::ToString’: no ove
    rloaded function takes 0 arguments (compiling source file ..
    \src\sass_types\number.cpp) [G:\Users\Frank\Documenten\Websi
    tes\www.gutenberg-theme.dev.cc\wp-content\plugins\jsforwp-ex
    ample-blocks\node_modules\node-sass\build\binding.vcxproj]
    g:\users\frank\documenten\websites\www.gutenberg-theme.dev
    .cc\wp-content\plugins\jsforwp-example-blocks\node_modules\n
    an\nan.h(1847): warning C4996: ‘v8::Object::Get’: was declar
    ed deprecated (compiling source file ..\src\sass_types\null.
    cpp) [G:\Users\Frank\Documenten\Websites\www.gutenberg-theme
    .dev.cc\wp-content\plugins\jsforwp-example-blocks\node_modul
    es\node-sass\build\binding.vcxproj]
    g:\users\frank\documenten\websites\www.gutenberg-theme.dev
    .cc\wp-content\plugins\jsforwp-example-blocks\node_modules\n
    an\nan_converters_43_inl.h(22): warning C4996: ‘v8::Value::T
    oBoolean’: was declared deprecated (compiling source file ..
    \src\sass_types\factory.cpp) [G:\Users\Frank\Documenten\Webs
    ites\www.gutenberg-theme.dev.cc\wp-content\plugins\jsforwp-e
    xample-blocks\node_modules\node-sass\build\binding.vcxproj]
    g:\users\frank\documenten\websites\www.gutenberg-theme.dev
    .cc\wp-content\plugins\jsforwp-example-blocks\node_modules\n
    an\nan.h(1830): warning C4996: ‘v8::Object::Set’: was declar
    ed deprecated (compiling source file ..\src\sass_types\numbe
    r.cpp) [G:\Users\Frank\Documenten\Websites\www.gutenberg-the
    me.dev.cc\wp-content\plugins\jsforwp-example-blocks\node_mod
    ules\node-sass\build\binding.vcxproj]
    g:\users\frank\documenten\websites\www.gutenberg-theme.dev
    .cc\wp-content\plugins\jsforwp-example-blocks\node_modules\n
    an\nan_converters_43_inl.h(40): warning C4996: ‘v8::Value::B
    ooleanValue’: was declared deprecated (compiling source file
    ..\src\sass_types\factory.cpp) [G:\Users\Frank\Documenten\W
    ebsites\www.gutenberg-theme.dev.cc\wp-content\plugins\jsforw
    p-example-blocks\node_modules\node-sass\build\binding.vcxpro
    j]
    g:\users\frank\documenten\websites\www.gutenberg-theme.dev
    .cc\wp-content\plugins\jsforwp-example-blocks\node_modules\n
    an\nan.h(1836): warning C4996: ‘v8::Object::Get’: was declar
    ed deprecated (compiling source file ..\src\sass_types\numbe
    r.cpp)c:\users\frank\.node-gyp\12.6.0\include\node\v8.h(2561
    ): note: see declaration of ‘v8::Value::BooleanValue’ (compi
    ling source file ..\src\sass_types\factory.cpp) [G:\Users\Fr
    ank\Documenten\Websites\www.gutenberg-theme.dev.cc\wp-conten
    t\plugins\jsforwp-example-blocks\node_modules\node-sass\buil
    d\binding.vcxproj]
    g:\users\frank\documenten\websites\www.gutenberg-theme.dev
    .cc\wp-content\plugins\jsforwp-example-blocks\node_modules\n
    an\nan_object_wrap.h(67): warning C4996: ‘v8::PersistentBase
    <v8::Object>::MarkIndependent’: was declared deprecated (com
    piling source file ..\src\sass_types\null.cpp)c:\users\frank
    \.node-gyp\12.6.0\include\node\v8.h(3412): note: see declara
    tion of ‘v8::Object::Get’ (compiling source file ..\src\sass
    _types\number.cpp) [G:\Users\Frank\Documenten\Websites\www.g
    utenberg-theme.dev.cc\wp-content\plugins\jsforwp-example-blo
    cks\node_modules\node-sass\build\binding.vcxproj]
    g:\users\frank\documenten\websites\www.gutenberg-theme.dev
    .cc\wp-content\plugins\jsforwp-example-blocks\node_modules\n
    an\nan.h(1842): warning C4996: ‘v8::Object::Get’: was declar
    ed deprecated (compiling source file ..\src\sass_types\numbe
    r.cpp) [G:\Users\Frank\Documenten\Websites\www.gutenberg-the
    me.dev.cc\wp-content\plugins\jsforwp-example-blocks\node_mod
    ules\node-sass\build\binding.vcxproj]
    g:\users\frank\documenten\websites\www.gutenberg-theme.dev
    .cc\wp-content\plugins\jsforwp-example-blocks\node_modules\n
    an\nan.h(1847): warning C4996: ‘v8::Object::Get’: was declar
    ed deprecated (compiling source file ..\src\sass_types\numbe
    r.cpp) [G:\Users\Frank\Documenten\Websites\www.gutenberg-the
    me.dev.cc\wp-content\plugins\jsforwp-example-blocks\node_mod
    ules\node-sass\build\binding.vcxproj]
    g:\users\frank\documenten\websites\www.gutenberg-theme.dev
    .cc\wp-content\plugins\jsforwp-example-blocks\node_modules\n
    an\nan_object_wrap.h(67): warning C4996: ‘v8::PersistentBase
    <v8::Object>::MarkIndependent’: was declared deprecated (com
    piling source file ..\src\sass_types\number.cpp) [G:\Users\F
    rank\Documenten\Websites\www.gutenberg-theme.dev.cc\wp-conte
    nt\plugins\jsforwp-example-blocks\node_modules\node-sass\bui
    ld\binding.vcxproj]
    g:\users\frank\documenten\websites\www.gutenberg-theme.dev
    .cc\wp-content\plugins\jsforwp-example-blocks\node_modules\n
    an\nan.h(1818): warning C4996: ‘v8::Object::Set’: was declar
    ed deprecated (compiling source file ..\src\sass_types\facto
    ry.cpp) [G:\Users\Frank\Documenten\Websites\www.gutenberg-th
    eme.dev.cc\wp-content\plugins\jsforwp-example-blocks\node_mo
    dules\node-sass\build\binding.vcxproj]
    g:\users\frank\documenten\websites\www.gutenberg-theme.dev
    .cc\wp-content\plugins\jsforwp-example-blocks\node_modules\n
    an\nan.h(1824): warning C4996: ‘v8::Object::Set’: was declar
    ed deprecated (compiling source file ..\src\sass_types\facto
    ry.cpp) [G:\Users\Frank\Documenten\Websites\www.gutenberg-th
    eme.dev.cc\wp-content\plugins\jsforwp-example-blocks\node_mo
    dules\node-sass\build\binding.vcxproj]
    g:\users\frank\documenten\websites\www.gutenberg-theme.dev
    .cc\wp-content\plugins\jsforwp-example-blocks\node_modules\n
    an\nan.h(1830): warning C4996: ‘v8::Object::Set’: was declar
    ed deprecated (compiling source file ..\src\sass_types\facto
    ry.cpp)g:\users\frank\documenten\websites\www.gutenberg-them
    e.dev.cc\wp-content\plugins\jsforwp-example-blocks\node_modu
    les\nan\nan_converters_43_inl.h(22): warning C4996: ‘v8::Val
    ue::ToBoolean’: was declared deprecated (compiling source fi
    le ..\src\sass_types\string.cpp) [G:\Users\Frank\Documenten\
    Websites\www.gutenberg-theme.dev.cc\wp-content\plugins\jsfor
    wp-example-blocks\node_modules\node-sass\build\binding.vcxpr
    oj]
    g:\users\frank\documenten\websites\www.gutenberg-theme.dev
    .cc\wp-content\plugins\jsforwp-example-blocks\node_modules\n
    an\nan_converters_43_inl.h(22): warning C4996: ‘v8::Value::T
    oBoolean’: was declared deprecated (compiling source file ..
    \src\sass_types\list.cpp) [G:\Users\Frank\Documenten\Website
    s\www.gutenberg-theme.dev.cc\wp-content\plugins\jsforwp-exam
    ple-blocks\node_modules\node-sass\build\binding.vcxproj]
    g:\users\frank\documenten\websites\www.gutenberg-theme.dev
    .cc\wp-content\plugins\jsforwp-example-blocks\node_modules\n
    an\nan.h(1836): warning C4996: ‘v8::Object::Get’: was declar
    ed deprecated (compiling source file ..\src\sass_types\facto
    ry.cpp) [G:\Users\Frank\Documenten\Websites\www.gutenberg-th
    eme.dev.cc\wp-content\plugins\jsforwp-example-blocks\node_mo
    dules\node-sass\build\binding.vcxproj]
    g:\users\frank\documenten\websites\www.gutenberg-theme.dev
    .cc\wp-content\plugins\jsforwp-example-blocks\node_modules\n
    an\nan.h(1847): warning C4996: ‘v8::Object::Get’: was declar
    ed deprecated (compiling source file ..\src\sass_types\facto
    ry.cpp)g:\users\frank\documenten\websites\www.gutenberg-them
    e.dev.cc\wp-content\plugins\jsforwp-example-blocks\node_modu
    les\nan\nan_converters_43_inl.h(40): warning C4996: ‘v8::Val
    ue::BooleanValue’: was declared deprecated (compiling source
    file ..\src\sass_types\list.cpp) [G:\Users\Frank\Documenten
    \Websites\www.gutenberg-theme.dev.cc\wp-content\plugins\jsfo
    rwp-example-blocks\node_modules\node-sass\build\binding.vcxp
    roj]
    g:\users\frank\documenten\websites\www.gutenberg-theme.dev
    .cc\wp-content\plugins\jsforwp-example-blocks\node_modules\n
    an\nan_converters_43_inl.h(40): warning C4996: ‘v8::Value::B
    ooleanValue’: was declared deprecated (compiling source file
    ..\src\sass_types\string.cpp)c:\users\frank\.node-gyp\12.6.
    0\include\node\v8.h(3416): note: see declaration of ‘v8::Obj
    ect::Get’ (compiling source file ..\src\sass_types\factory.c
    pp) [G:\Users\Frank\Documenten\Websites\www.gutenberg-theme.
    dev.cc\wp-content\plugins\jsforwp-example-blocks\node_module
    s\node-sass\build\binding.vcxproj]
    g:\users\frank\documenten\websites\www.gutenberg-theme.dev
    .cc\wp-content\plugins\jsforwp-example-blocks\node_modules\n
    an\nan_object_wrap.h(67): warning C4996: ‘v8::PersistentBase
    <v8::Object>::MarkIndependent’: was declared deprecated (com
    piling source file ..\src\sass_types\factory.cpp) [G:\Users\
    Frank\Documenten\Websites\www.gutenberg-theme.dev.cc\wp-cont
    ent\plugins\jsforwp-example-blocks\node_modules\node-sass\bu
    ild\binding.vcxproj]
    g:\users\frank\documenten\websites\www.gutenberg-theme.dev
    .cc\wp-content\plugins\jsforwp-example-blocks\node_modules\n
    an\nan.h(1818): warning C4996: ‘v8::Object::Set’: was declar
    ed deprecated (compiling source file ..\src\sass_types\list.
    cpp) [G:\Users\Frank\Documenten\Websites\www.gutenberg-theme
    .dev.cc\wp-content\plugins\jsforwp-example-blocks\node_modul
    es\node-sass\build\binding.vcxproj]
    g:\users\frank\documenten\websites\www.gutenberg-theme.dev
    .cc\wp-content\plugins\jsforwp-example-blocks\node_modules\n
    an\nan.h(1824): warning C4996: ‘v8::Object::Set’: was declar
    ed deprecated (compiling source file ..\src\sass_types\list.
    cpp) [G:\Users\Frank\Documenten\Websites\www.gutenberg-theme
    .dev.cc\wp-content\plugins\jsforwp-example-blocks\node_modul
    es\node-sass\build\binding.vcxproj]
    g:\users\frank\documenten\websites\www.gutenberg-theme.dev
    .cc\wp-content\plugins\jsforwp-example-blocks\node_modules\n
    an\nan.h(1830): warning C4996: ‘v8::Object::Set’: was declar
    ed deprecated (compiling source file ..\src\sass_types\list.
    cpp) [G:\Users\Frank\Documenten\Websites\www.gutenberg-theme
    .dev.cc\wp-content\plugins\jsforwp-example-blocks\node_modul
    es\node-sass\build\binding.vcxproj]
    g:\users\frank\documenten\websites\www.gutenberg-theme.dev
    .cc\wp-content\plugins\jsforwp-example-blocks\node_modules\n
    an\nan.h(1836): warning C4996: ‘v8::Object::Get’: was declar
    ed deprecated (compiling source file ..\src\sass_types\list.
    cpp) [G:\Users\Frank\Documenten\Websites\www.gutenberg-theme
    .dev.cc\wp-content\plugins\jsforwp-example-blocks\node_modul
    es\node-sass\build\binding.vcxproj]
    g:\users\frank\documenten\websites\www.gutenberg-theme.dev
    .cc\wp-content\plugins\jsforwp-example-blocks\node_modules\n
    an\nan.h(1842): warning C4996: ‘v8::Object::Get’: was declar
    ed deprecated (compiling source file ..\src\sass_types\list.
    cpp) [G:\Users\Frank\Documenten\Websites\www.gutenberg-theme
    .dev.cc\wp-content\plugins\jsforwp-example-blocks\node_modul
    es\node-sass\build\binding.vcxproj]
    g:\users\frank\documenten\websites\www.gutenberg-theme.dev
    .cc\wp-content\plugins\jsforwp-example-blocks\node_modules\n
    an\nan.h(1847): warning C4996: ‘v8::Object::Get’: was declar
    ed deprecated (compiling source file ..\src\sass_types\list.
    cpp) [G:\Users\Frank\Documenten\Websites\www.gutenberg-theme
    .dev.cc\wp-content\plugins\jsforwp-example-blocks\node_modul
    es\node-sass\build\binding.vcxproj]
    g:\users\frank\documenten\websites\www.gutenberg-theme.dev
    .cc\wp-content\plugins\jsforwp-example-blocks\node_modules\n
    an\nan.h(1818): warning C4996: ‘v8::Object::Set’: was declar
    ed deprecated (compiling source file ..\src\sass_types\strin
    g.cpp) [G:\Users\Frank\Documenten\Websites\www.gutenberg-the
    me.dev.cc\wp-content\plugins\jsforwp-example-blocks\node_mod
    ules\node-sass\build\binding.vcxproj]
    g:\users\frank\documenten\websites\www.gutenberg-theme.dev
    .cc\wp-content\plugins\jsforwp-example-blocks\node_modules\n
    an\nan.h(1824): warning C4996: ‘v8::Object::Set’: was declar
    ed deprecated (compiling source file ..\src\sass_types\strin
    g.cpp) [G:\Users\Frank\Documenten\Websites\www.gutenberg-the
    me.dev.cc\wp-content\plugins\jsforwp-example-blocks\node_mod
    ules\node-sass\build\binding.vcxproj]
    g:\users\frank\documenten\websites\www.gutenberg-theme.dev
    .cc\wp-content\plugins\jsforwp-example-blocks\node_modules\n
    an\nan.h(1830): warning C4996: ‘v8::Object::Set’: was declar
    ed deprecated (compiling source file ..\src\sass_types\strin
    g.cpp) [G:\Users\Frank\Documenten\Websites\www.gutenberg-the
    me.dev.cc\wp-content\plugins\jsforwp-example-blocks\node_mod
    ules\node-sass\build\binding.vcxproj]
    g:\users\frank\documenten\websites\www.gutenberg-theme.dev
    .cc\wp-content\plugins\jsforwp-example-blocks\node_modules\n
    an\nan.h(1847): warning C4996: ‘v8::Object::Get’: was declar
    ed deprecated (compiling source file ..\src\sass_types\strin
    g.cpp)g:\users\frank\documenten\websites\www.gutenberg-theme
    .dev.cc\wp-content\plugins\jsforwp-example-blocks\node_modul
    es\nan\nan_object_wrap.h(67): warning C4996: ‘v8::Persistent
    Base<v8::Object>::MarkIndependent’: was declared deprecated
    (compiling source file ..\src\sass_types\list.cpp) [G:\Users
    \Frank\Documenten\Websites\www.gutenberg-theme.dev.cc\wp-con
    tent\plugins\jsforwp-example-blocks\node_modules\node-sass\b
    uild\binding.vcxproj]
    g:\users\frank\documenten\websites\www.gutenberg-theme.dev
    .cc\wp-content\plugins\jsforwp-example-blocks\node_modules\n
    an\nan_object_wrap.h(67): warning C4996: ‘v8::PersistentBase
    <v8::Object>::MarkIndependent’: was declared deprecated (com
    piling source file ..\src\sass_types\string.cpp) [G:\Users\F
    rank\Documenten\Websites\www.gutenberg-theme.dev.cc\wp-conte
    nt\plugins\jsforwp-example-blocks\node_modules\node-sass\bui
    ld\binding.vcxproj]

    “G:\Users\Frank\Documenten\Websites\www.gutenberg-theme.dev.
    cc\wp-content\plugins\jsforwp-example-blocks\node_modules\no
    de-sass\build\binding.sln” (default target) (1) ->
    “G:\Users\Frank\Documenten\Websites\www.gutenberg-theme.dev.
    cc\wp-content\plugins\jsforwp-example-blocks\node_modules\no
    de-sass\build\binding.vcxproj.metaproj” (default target) (2)
    ->
    “G:\Users\Frank\Documenten\Websites\www.gutenberg-theme.dev.
    cc\wp-content\plugins\jsforwp-example-blocks\node_modules\no
    de-sass\build\binding.vcxproj” (default target) (4) ->
    (ClCompile target) ->
    g:\users\frank\documenten\websites\www.gutenberg-theme.dev
    .cc\wp-content\plugins\jsforwp-example-blocks\node_modules\n
    an\nan_implementation_12_inl.h(103): error C2664: ‘v8::Maybe
    Local<v8::Function> v8::Function::New(v8::Local<v8::Context>
    ,v8::FunctionCallback,v8::Local<v8::Value>,int,v8::Construct
    orBehavior,v8::SideEffectType)’: cannot convert argument 1 f
    rom ‘v8::Isolate *’ to ‘v8::Local<v8::Context>’ (compiling s
    ource file ..\src\sass_types\color.cpp)g:\users\frank\docume
    nten\websites\www.gutenberg-theme.dev.cc\wp-content\plugins\
    jsforwp-example-blocks\node_modules\nan\nan_converters_43_in
    l.h(40): warning C4996: ‘v8::Value::BooleanValue’: was decla
    red deprecated (compiling source file ..\src\sass_types\bool
    ean.cpp) [G:\Users\Frank\Documenten\Websites\www.gutenberg-t
    heme.dev.cc\wp-content\plugins\jsforwp-example-blocks\node_m
    odules\node-sass\build\binding.vcxproj]
    g:\users\frank\documenten\websites\www.gutenberg-theme.dev
    .cc\wp-content\plugins\jsforwp-example-blocks\node_modules\n
    an\nan_implementation_12_inl.h(103): error C2664: ‘v8::Maybe
    Local<v8::Function> v8::Function::New(v8::Local<v8::Context>
    ,v8::FunctionCallback,v8::Local<v8::Value>,int,v8::Construct
    orBehavior,v8::SideEffectType)’: cannot convert argument 1 f
    rom ‘v8::Isolate *’ to ‘v8::Local<v8::Context>’ (compiling s
    ource file ..\src\custom_importer_bridge.cpp)g:\users\frank\
    documenten\websites\www.gutenberg-theme.dev.cc\wp-content\pl
    ugins\jsforwp-example-blocks\node_modules\nan\nan_implementa
    tion_12_inl.h(105): note: No constructor could take the sour
    ce type, or constructor overload resolution was ambiguous (c
    ompiling source file ..\src\sass_types\error.cpp) [G:\Users\
    Frank\Documenten\Websites\www.gutenberg-theme.dev.cc\wp-cont
    ent\plugins\jsforwp-example-blocks\node_modules\node-sass\bu
    ild\binding.vcxproj]
    g:\users\frank\documenten\websites\www.gutenberg-theme.dev
    .cc\wp-content\plugins\jsforwp-example-blocks\node_modules\n
    an\nan_implementation_12_inl.h(337): error C2660: ‘v8::Strin
    gObject::New’: function does not take 1 arguments (compiling
    source file ..\src\sass_types\error.cpp)g:\users\frank\docu
    menten\websites\www.gutenberg-theme.dev.cc\wp-content\plugin
    s\jsforwp-example-blocks\node_modules\nan\nan_implementation
    _12_inl.h(105): note: No constructor could take the source t
    ype, or constructor overload resolution was ambiguous (compi
    ling source file ..\src\sass_types\boolean.cpp) [G:\Users\Fr
    ank\Documenten\Websites\www.gutenberg-theme.dev.cc\wp-conten
    t\plugins\jsforwp-example-blocks\node_modules\node-sass\buil
    d\binding.vcxproj]
    g:\users\frank\documenten\websites\www.gutenberg-theme.dev
    .cc\wp-content\plugins\jsforwp-example-blocks\node_modules\n
    an\nan_implementation_12_inl.h(337): error C2660: ‘v8::Strin
    gObject::New’: function does not take 1 arguments (compiling
    source file ..\src\sass_types\color.cpp) [G:\Users\Frank\Do
    cumenten\Websites\www.gutenberg-theme.dev.cc\wp-content\plug
    ins\jsforwp-example-blocks\node_modules\node-sass\build\bind
    ing.vcxproj]
    g:\users\frank\documenten\websites\www.gutenberg-theme.dev
    .cc\wp-content\plugins\jsforwp-example-blocks\node_modules\n
    an\nan_implementation_12_inl.h(103): error C2664: ‘v8::Maybe
    Local<v8::Function> v8::Function::New(v8::Local<v8::Context>
    ,v8::FunctionCallback,v8::Local<v8::Value>,int,v8::Construct
    orBehavior,v8::SideEffectType)’: cannot convert argument 1 f
    rom ‘v8::Isolate *’ to ‘v8::Local<v8::Context>’ (compiling s
    ource file ..\src\create_string.cpp) [G:\Users\Frank\Documen
    ten\Websites\www.gutenberg-theme.dev.cc\wp-content\plugins\j
    sforwp-example-blocks\node_modules\node-sass\build\binding.v
    cxproj]
    g:\users\frank\documenten\websites\www.gutenberg-theme.dev
    .cc\wp-content\plugins\jsforwp-example-blocks\node_modules\n
    an\nan_implementation_12_inl.h(337): error C2059: syntax err
    or: ‘)’ (compiling source file ..\src\sass_types\color.cpp)c
    :\users\frank\.node-gyp\12.6.0\include\node\v8.h(2561): note
    : see declaration of ‘v8::Value::BooleanValue’ (compiling so
    urce file ..\src\binding.cpp) [G:\Users\Frank\Documenten\Web
    sites\www.gutenberg-theme.dev.cc\wp-content\plugins\jsforwp-
    example-blocks\node_modules\node-sass\build\binding.vcxproj]
    g:\users\frank\documenten\websites\www.gutenberg-theme.dev
    .cc\wp-content\plugins\jsforwp-example-blocks\node_modules\n
    an\nan_implementation_12_inl.h(103): error C2664: ‘v8::Maybe
    Local<v8::Function> v8::Function::New(v8::Local<v8::Context>
    ,v8::FunctionCallback,v8::Local<v8::Value>,int,v8::Construct
    orBehavior,v8::SideEffectType)’: cannot convert argument 1 f
    rom ‘v8::Isolate *’ to ‘v8::Local<v8::Context>’ (compiling s
    ource file ..\src\custom_function_bridge.cpp) [G:\Users\Fran
    k\Documenten\Websites\www.gutenberg-theme.dev.cc\wp-content\
    plugins\jsforwp-example-blocks\node_modules\node-sass\build\
    binding.vcxproj]
    g:\users\frank\documenten\websites\www.gutenberg-theme.dev
    .cc\wp-content\plugins\jsforwp-example-blocks\node_modules\n
    an\nan_implementation_12_inl.h(337): error C2059: syntax err
    or: ‘)’ (compiling source file ..\src\custom_importer_bridge
    .cpp) [G:\Users\Frank\Documenten\Websites\www.gutenberg-them
    e.dev.cc\wp-content\plugins\jsforwp-example-blocks\node_modu
    les\node-sass\build\binding.vcxproj]
    g:\users\frank\documenten\websites\www.gutenberg-theme.dev
    .cc\wp-content\plugins\jsforwp-example-blocks\node_modules\n
    an\nan_implementation_12_inl.h(337): error C2660: ‘v8::Strin
    gObject::New’: function does not take 1 arguments (compiling
    source file ..\src\create_string.cpp) [G:\Users\Frank\Docum
    enten\Websites\www.gutenberg-theme.dev.cc\wp-content\plugins
    \jsforwp-example-blocks\node_modules\node-sass\build\binding
    .vcxproj]
    g:\users\frank\documenten\websites\www.gutenberg-theme.dev
    .cc\wp-content\plugins\jsforwp-example-blocks\node_modules\n
    an\nan_implementation_12_inl.h(337): error C2660: ‘v8::Strin
    gObject::New’: function does not take 1 arguments (compiling
    source file ..\src\sass_types\boolean.cpp) [G:\Users\Frank\
    Documenten\Websites\www.gutenberg-theme.dev.cc\wp-content\pl
    ugins\jsforwp-example-blocks\node_modules\node-sass\build\bi
    nding.vcxproj]
    g:\users\frank\documenten\websites\www.gutenberg-theme.dev
    .cc\wp-content\plugins\jsforwp-example-blocks\node_modules\n
    an\nan.h(1034): error C2661: ‘v8::Value::ToString’: no overl
    oaded function takes 0 arguments (compiling source file ..\s
    rc\sass_context_wrapper.cpp) [G:\Users\Frank\Documenten\Webs
    ites\www.gutenberg-theme.dev.cc\wp-content\plugins\jsforwp-e
    xample-blocks\node_modules\node-sass\build\binding.vcxproj]
    g:\users\frank\documenten\websites\www.gutenberg-theme.dev
    .cc\wp-content\plugins\jsforwp-example-blocks\node_modules\n
    an\nan_implementation_12_inl.h(103): error C2664: ‘v8::Maybe
    Local<v8::Function> v8::Function::New(v8::Local<v8::Context>
    ,v8::FunctionCallback,v8::Local<v8::Value>,int,v8::Construct
    orBehavior,v8::SideEffectType)’: cannot convert argument 1 f
    rom ‘v8::Isolate *’ to ‘v8::Local<v8::Context>’ (compiling s
    ource file ..\src\binding.cpp) [G:\Users\Frank\Documenten\We
    bsites\www.gutenberg-theme.dev.cc\wp-content\plugins\jsforwp
    -example-blocks\node_modules\node-sass\build\binding.vcxproj
    ]
    g:\users\frank\documenten\websites\www.gutenberg-theme.dev
    .cc\wp-content\plugins\jsforwp-example-blocks\node_modules\n
    an\nan_implementation_12_inl.h(337): error C2059: syntax err
    or: ‘)’ (compiling source file ..\src\create_string.cpp) [G:
    \Users\Frank\Documenten\Websites\www.gutenberg-theme.dev.cc\
    wp-content\plugins\jsforwp-example-blocks\node_modules\node-
    sass\build\binding.vcxproj]
    g:\users\frank\documenten\websites\www.gutenberg-theme.dev
    .cc\wp-content\plugins\jsforwp-example-blocks\node_modules\n
    an\nan_implementation_12_inl.h(337): error C2059: syntax err
    or: ‘)’ (compiling source file ..\src\sass_types\boolean.cpp
    ) [G:\Users\Frank\Documenten\Websites\www.gutenberg-theme.de
    v.cc\wp-content\plugins\jsforwp-example-blocks\node_modules\
    node-sass\build\binding.vcxproj]
    g:\users\frank\documenten\websites\www.gutenberg-theme.dev
    .cc\wp-content\plugins\jsforwp-example-blocks\node_modules\n
    an\nan.h(1044): error C2664: ‘int v8::String::WriteUtf8(v8::
    Isolate *,char *,int,int *,int) const’: cannot convert argum
    ent 1 from ‘char *’ to ‘v8::Isolate *’ (compiling source fil
    e ..\src\sass_context_wrapper.cpp) [G:\Users\Frank\Documente
    n\Websites\www.gutenberg-theme.dev.cc\wp-content\plugins\jsf
    orwp-example-blocks\node_modules\node-sass\build\binding.vcx
    proj]
    g:\users\frank\documenten\websites\www.gutenberg-theme.dev
    .cc\wp-content\plugins\jsforwp-example-blocks\node_modules\n
    an\nan_implementation_12_inl.h(337): error C2660: ‘v8::Strin
    gObject::New’: function does not take 1 arguments (compiling
    source file ..\src\custom_function_bridge.cpp) [G:\Users\Fr
    ank\Documenten\Websites\www.gutenberg-theme.dev.cc\wp-conten
    t\plugins\jsforwp-example-blocks\node_modules\node-sass\buil
    d\binding.vcxproj]
    g:\users\frank\documenten\websites\www.gutenberg-theme.dev
    .cc\wp-content\plugins\jsforwp-example-blocks\node_modules\n
    an\nan.h(1034): error C2661: ‘v8::Value::ToString’: no overl
    oaded function takes 0 arguments (compiling source file ..\s
    rc\sass_types\error.cpp) [G:\Users\Frank\Documenten\Websites
    \www.gutenberg-theme.dev.cc\wp-content\plugins\jsforwp-examp
    le-blocks\node_modules\node-sass\build\binding.vcxproj]
    g:\users\frank\documenten\websites\www.gutenberg-theme.dev
    .cc\wp-content\plugins\jsforwp-example-blocks\node_modules\n
    an\nan_implementation_12_inl.h(337): error C2660: ‘v8::Strin
    gObject::New’: function does not take 1 arguments (compiling
    source file ..\src\binding.cpp) [G:\Users\Frank\Documenten\
    Websites\www.gutenberg-theme.dev.cc\wp-content\plugins\jsfor
    wp-example-blocks\node_modules\node-sass\build\binding.vcxpr
    oj]
    g:\users\frank\documenten\websites\www.gutenberg-theme.dev
    .cc\wp-content\plugins\jsforwp-example-blocks\node_modules\n
    an\nan.h(1034): error C2661: ‘v8::Value::ToString’: no overl
    oaded function takes 0 arguments (compiling source file ..\s
    rc\sass_types\color.cpp) [G:\Users\Frank\Documenten\Websites
    \www.gutenberg-theme.dev.cc\wp-content\plugins\jsforwp-examp
    le-blocks\node_modules\node-sass\build\binding.vcxproj]
    g:\users\frank\documenten\websites\www.gutenberg-theme.dev
    .cc\wp-content\plugins\jsforwp-example-blocks\node_modules\n
    an\nan_implementation_12_inl.h(337): error C2059: syntax err
    or: ‘)’ (compiling source file ..\src\custom_function_bridge
    .cpp) [G:\Users\Frank\Documenten\Websites\www.gutenberg-them
    e.dev.cc\wp-content\plugins\jsforwp-example-blocks\node_modu
    les\node-sass\build\binding.vcxproj]
    g:\users\frank\documenten\websites\www.gutenberg-theme.dev
    .cc\wp-content\plugins\jsforwp-example-blocks\node_modules\n
    an\nan.h(1044): error C2664: ‘int v8::String::WriteUtf8(v8::
    Isolate *,char *,int,int *,int) const’: cannot convert argum
    ent 1 from ‘char *’ to ‘v8::Isolate *’ (compiling source fil
    e ..\src\sass_types\error.cpp) [G:\Users\Frank\Documenten\We
    bsites\www.gutenberg-theme.dev.cc\wp-content\plugins\jsforwp
    -example-blocks\node_modules\node-sass\build\binding.vcxproj
    ]
    g:\users\frank\documenten\websites\www.gutenberg-theme.dev
    .cc\wp-content\plugins\jsforwp-example-blocks\node_modules\n
    an\nan_implementation_12_inl.h(337): error C2059: syntax err
    or: ‘)’ (compiling source file ..\src\binding.cpp) [G:\Users
    \Frank\Documenten\Websites\www.gutenberg-theme.dev.cc\wp-con
    tent\plugins\jsforwp-example-blocks\node_modules\node-sass\b
    uild\binding.vcxproj]
    g:\users\frank\documenten\websites\www.gutenberg-theme.dev
    .cc\wp-content\plugins\jsforwp-example-blocks\node_modules\n
    an\nan.h(1044): error C2664: ‘int v8::String::WriteUtf8(v8::
    Isolate *,char *,int,int *,int) const’: cannot convert argum
    ent 1 from ‘char *’ to ‘v8::Isolate *’ (compiling source fil
    e ..\src\sass_types\color.cpp) [G:\Users\Frank\Documenten\We
    bsites\www.gutenberg-theme.dev.cc\wp-content\plugins\jsforwp
    -example-blocks\node_modules\node-sass\build\binding.vcxproj
    ]
    g:\users\frank\documenten\websites\www.gutenberg-theme.dev
    .cc\wp-content\plugins\jsforwp-example-blocks\node_modules\n
    an\nan.h(1034): error C2661: ‘v8::Value::ToString’: no overl
    oaded function takes 0 arguments (compiling source file ..\s
    rc\sass_types\boolean.cpp) [G:\Users\Frank\Documenten\Websit
    es\www.gutenberg-theme.dev.cc\wp-content\plugins\jsforwp-exa
    mple-blocks\node_modules\node-sass\build\binding.vcxproj]
    g:\users\frank\documenten\websites\www.gutenberg-theme.dev
    .cc\wp-content\plugins\jsforwp-example-blocks\node_modules\n
    an\nan.h(1034): error C2661: ‘v8::Value::ToString’: no overl
    oaded function takes 0 arguments (compiling source file ..\s
    rc\create_string.cpp) [G:\Users\Frank\Documenten\Websites\ww
    w.gutenberg-theme.dev.cc\wp-content\plugins\jsforwp-example-
    blocks\node_modules\node-sass\build\binding.vcxproj]
    g:\users\frank\documenten\websites\www.gutenberg-theme.dev
    .cc\wp-content\plugins\jsforwp-example-blocks\node_modules\n
    an\nan.h(1034): error C2661: ‘v8::Value::ToString’: no overl
    oaded function takes 0 arguments (compiling source file ..\s
    rc\custom_importer_bridge.cpp) [G:\Users\Frank\Documenten\We
    bsites\www.gutenberg-theme.dev.cc\wp-content\plugins\jsforwp
    -example-blocks\node_modules\node-sass\build\binding.vcxproj
    ]
    g:\users\frank\documenten\websites\www.gutenberg-theme.dev
    .cc\wp-content\plugins\jsforwp-example-blocks\node_modules\n
    an\nan.h(1044): error C2664: ‘int v8::String::WriteUtf8(v8::
    Isolate *,char *,int,int *,int) const’: cannot convert argum
    ent 1 from ‘char *’ to ‘v8::Isolate *’ (compiling source fil
    e ..\src\sass_types\boolean.cpp) [G:\Users\Frank\Documenten\
    Websites\www.gutenberg-theme.dev.cc\wp-content\plugins\jsfor
    wp-example-blocks\node_modules\node-sass\build\binding.vcxpr
    oj]
    g:\users\frank\documenten\websites\www.gutenberg-theme.dev
    .cc\wp-content\plugins\jsforwp-example-blocks\node_modules\n
    an\nan.h(1044): error C2664: ‘int v8::String::WriteUtf8(v8::
    Isolate *,char *,int,int *,int) const’: cannot convert argum
    ent 1 from ‘char *’ to ‘v8::Isolate *’ (compiling source fil
    e ..\src\create_string.cpp) [G:\Users\Frank\Documenten\Websi
    tes\www.gutenberg-theme.dev.cc\wp-content\plugins\jsforwp-ex
    ample-blocks\node_modules\node-sass\build\binding.vcxproj]
    g:\users\frank\documenten\websites\www.gutenberg-theme.dev
    .cc\wp-content\plugins\jsforwp-example-blocks\node_modules\n
    an\nan.h(1044): error C2664: ‘int v8::String::WriteUtf8(v8::
    Isolate *,char *,int,int *,int) const’: cannot convert argum
    ent 1 from ‘char *’ to ‘v8::Isolate *’ (compiling source fil
    e ..\src\custom_importer_bridge.cpp) [G:\Users\Frank\Documen
    ten\Websites\www.gutenberg-theme.dev.cc\wp-content\plugins\j
    sforwp-example-blocks\node_modules\node-sass\build\binding.v
    cxproj]
    g:\users\frank\documenten\websites\www.gutenberg-theme.dev
    .cc\wp-content\plugins\jsforwp-example-blocks\node_modules\n
    an\nan.h(1034): error C2661: ‘v8::Value::ToString’: no overl
    oaded function takes 0 arguments (compiling source file ..\s
    rc\custom_function_bridge.cpp) [G:\Users\Frank\Documenten\We
    bsites\www.gutenberg-theme.dev.cc\wp-content\plugins\jsforwp
    -example-blocks\node_modules\node-sass\build\binding.vcxproj
    ]
    g:\users\frank\documenten\websites\www.gutenberg-theme.dev
    .cc\wp-content\plugins\jsforwp-example-blocks\node_modules\n
    an\nan.h(1034): error C2661: ‘v8::Value::ToString’: no overl
    oaded function takes 0 arguments (compiling source file ..\s
    rc\binding.cpp) [G:\Users\Frank\Documenten\Websites\www.gute
    nberg-theme.dev.cc\wp-content\plugins\jsforwp-example-blocks
    \node_modules\node-sass\build\binding.vcxproj]
    g:\users\frank\documenten\websites\www.gutenberg-theme.dev
    .cc\wp-content\plugins\jsforwp-example-blocks\node_modules\n
    an\nan.h(1044): error C2664: ‘int v8::String::WriteUtf8(v8::
    Isolate *,char *,int,int *,int) const’: cannot convert argum
    ent 1 from ‘char *’ to ‘v8::Isolate *’ (compiling source fil
    e ..\src\binding.cpp) [G:\Users\Frank\Documenten\Websites\ww
    w.gutenberg-theme.dev.cc\wp-content\plugins\jsforwp-example-
    blocks\node_modules\node-sass\build\binding.vcxproj]
    g:\users\frank\documenten\websites\www.gutenberg-theme.dev
    .cc\wp-content\plugins\jsforwp-example-blocks\node_modules\n
    an\nan_object_wrap.h(124): error C2039: ‘IsNearDeath’: is no
    t a member of ‘Nan::Persistent<v8::Object,v8::NonCopyablePer
    sistentTraits<T>>’ [G:\Users\Frank\Documenten\Websites\www.g
    utenberg-theme.dev.cc\wp-content\plugins\jsforwp-example-blo
    cks\node_modules\node-sass\build\binding.vcxproj]
    g:\users\frank\documenten\websites\www.gutenberg-theme.dev
    .cc\wp-content\plugins\jsforwp-example-blocks\node_modules\n
    an\nan_object_wrap.h(24): error C2039: ‘IsNearDeath’: is not
    a member of ‘Nan::Persistent<v8::Object,v8::NonCopyablePers
    istentTraits<T>>’ [G:\Users\Frank\Documenten\Websites\www.gu
    tenberg-theme.dev.cc\wp-content\plugins\jsforwp-example-bloc
    ks\node_modules\node-sass\build\binding.vcxproj]
    g:\users\frank\documenten\websites\www.gutenberg-theme.dev
    .cc\wp-content\plugins\jsforwp-example-blocks\node_modules\n
    an\nan_object_wrap.h(124): error C2039: ‘IsNearDeath’: is no
    t a member of ‘Nan::Persistent<v8::Object,v8::NonCopyablePer
    sistentTraits<T>>’ [G:\Users\Frank\Documenten\Websites\www.g
    utenberg-theme.dev.cc\wp-content\plugins\jsforwp-example-blo
    cks\node_modules\node-sass\build\binding.vcxproj]
    g:\users\frank\documenten\websites\www.gutenberg-theme.dev
    .cc\wp-content\plugins\jsforwp-example-blocks\node_modules\n
    an\nan_object_wrap.h(124): error C2039: ‘IsNearDeath’: is no
    t a member of ‘Nan::Persistent<v8::Object,v8::NonCopyablePer
    sistentTraits<T>>’ [G:\Users\Frank\Documenten\Websites\www.g
    utenberg-theme.dev.cc\wp-content\plugins\jsforwp-example-blo
    cks\node_modules\node-sass\build\binding.vcxproj]
    g:\users\frank\documenten\websites\www.gutenberg-theme.dev
    .cc\wp-content\plugins\jsforwp-example-blocks\node_modules\n
    ode-sass\src\create_string.cpp(17): error C2664: ‘v8::String
    ::Utf8Value::Utf8Value(const v8::String::Utf8Value &)’: cann
    ot convert argument 1 from ‘v8::Local<v8::Value>’ to ‘const
    v8::String::Utf8Value &’c:\users\frank\.node-gyp\12.6.0\incl
    ude\node\v8.h(3412): note: see declaration of ‘v8::Object::G
    et’ (compiling source file ..\src\sass_types\boolean.cpp) [G
    :\Users\Frank\Documenten\Websites\www.gutenberg-theme.dev.cc
    \wp-content\plugins\jsforwp-example-blocks\node_modules\node
    -sass\build\binding.vcxproj]
    g:\users\frank\documenten\websites\www.gutenberg-theme.dev
    .cc\wp-content\plugins\jsforwp-example-blocks\node_modules\n
    an\nan_object_wrap.h(124): error C2039: ‘IsNearDeath’: is no
    t a member of ‘Nan::Persistent<v8::Object,v8::NonCopyablePer
    sistentTraits<T>>’ [G:\Users\Frank\Documenten\Websites\www.g
    utenberg-theme.dev.cc\wp-content\plugins\jsforwp-example-blo
    cks\node_modules\node-sass\build\binding.vcxproj]
    g:\users\frank\documenten\websites\www.gutenberg-theme.dev
    .cc\wp-content\plugins\jsforwp-example-blocks\node_modules\n
    an\nan_object_wrap.h(24): error C2039: ‘IsNearDeath’: is not
    a member of ‘Nan::Persistent<v8::Object,v8::NonCopyablePers
    istentTraits<T>>’ [G:\Users\Frank\Documenten\Websites\www.gu
    tenberg-theme.dev.cc\wp-content\plugins\jsforwp-example-bloc
    ks\node_modules\node-sass\build\binding.vcxproj]
    g:\users\frank\documenten\websites\www.gutenberg-theme.dev
    .cc\wp-content\plugins\jsforwp-example-blocks\node_modules\n
    an\nan_object_wrap.h(24): error C2039: ‘IsNearDeath’: is not
    a member of ‘Nan::Persistent<v8::Object,v8::NonCopyablePers
    istentTraits<T>>’ [G:\Users\Frank\Documenten\Websites\www.gu
    tenberg-theme.dev.cc\wp-content\plugins\jsforwp-example-bloc
    ks\node_modules\node-sass\build\binding.vcxproj]
    g:\users\frank\documenten\websites\www.gutenberg-theme.dev
    .cc\wp-content\plugins\jsforwp-example-blocks\node_modules\n
    an\nan_object_wrap.h(124): error C2039: ‘IsNearDeath’: is no
    t a member of ‘Nan::Persistent<v8::Object,v8::NonCopyablePer
    sistentTraits<T>>’ [G:\Users\Frank\Documenten\Websites\www.g
    utenberg-theme.dev.cc\wp-content\plugins\jsforwp-example-blo
    cks\node_modules\node-sass\build\binding.vcxproj]
    g:\users\frank\documenten\websites\www.gutenberg-theme.dev
    .cc\wp-content\plugins\jsforwp-example-blocks\node_modules\n
    an\nan_object_wrap.h(124): error C2039: ‘IsNearDeath’: is no
    t a member of ‘Nan::Persistent<v8::Object,v8::NonCopyablePer
    sistentTraits<T>>’ [G:\Users\Frank\Documenten\Websites\www.g
    utenberg-theme.dev.cc\wp-content\plugins\jsforwp-example-blo
    cks\node_modules\node-sass\build\binding.vcxproj]
    g:\users\frank\documenten\websites\www.gutenberg-theme.dev
    .cc\wp-content\plugins\jsforwp-example-blocks\node_modules\n
    an\nan_implementation_12_inl.h(103): error C2664: ‘v8::Maybe
    Local<v8::Function> v8::Function::New(v8::Local<v8::Context>
    ,v8::FunctionCallback,v8::Local<v8::Value>,int,v8::Construct
    orBehavior,v8::SideEffectType)’: cannot convert argument 1 f
    rom ‘v8::Isolate *’ to ‘v8::Local<v8::Context>’ (compiling s
    ource file ..\src\sass_types\map.cpp) [G:\Users\Frank\Docume
    nten\Websites\www.gutenberg-theme.dev.cc\wp-content\plugins\
    jsforwp-example-blocks\node_modules\node-sass\build\binding.
    vcxproj]
    g:\users\frank\documenten\websites\www.gutenberg-theme.dev
    .cc\wp-content\plugins\jsforwp-example-blocks\node_modules\n
    an\nan_implementation_12_inl.h(337): error C2059: syntax err
    or: ‘)’ (compiling source file ..\src\sass_types\map.cpp) [G
    :\Users\Frank\Documenten\Websites\www.gutenberg-theme.dev.cc
    \wp-content\plugins\jsforwp-example-blocks\node_modules\node
    -sass\build\binding.vcxproj]
    g:\users\frank\documenten\websites\www.gutenberg-theme.dev
    .cc\wp-content\plugins\jsforwp-example-blocks\node_modules\n
    an\nan_implementation_12_inl.h(337): error C2660: ‘v8::Strin
    gObject::New’: function does not take 1 arguments (compiling
    source file ..\src\sass_types\null.cpp) [G:\Users\Frank\Doc
    umenten\Websites\www.gutenberg-theme.dev.cc\wp-content\plugi
    ns\jsforwp-example-blocks\node_modules\node-sass\build\bindi
    ng.vcxproj]
    g:\users\frank\documenten\websites\www.gutenberg-theme.dev
    .cc\wp-content\plugins\jsforwp-example-blocks\node_modules\n
    an\nan.h(1044): error C2664: ‘int v8::String::WriteUtf8(v8::
    Isolate *,char *,int,int *,int) const’: cannot convert argum
    ent 1 from ‘char *’ to ‘v8::Isolate *’ (compiling source fil
    e ..\src\sass_types\map.cpp) [G:\Users\Frank\Documenten\Webs
    ites\www.gutenberg-theme.dev.cc\wp-content\plugins\jsforwp-e
    xample-blocks\node_modules\node-sass\build\binding.vcxproj]
    g:\users\frank\documenten\websites\www.gutenberg-theme.dev
    .cc\wp-content\plugins\jsforwp-example-blocks\node_modules\n
    an\nan_implementation_12_inl.h(103): error C2664: ‘v8::Maybe
    Local<v8::Function> v8::Function::New(v8::Local<v8::Context>
    ,v8::FunctionCallback,v8::Local<v8::Value>,int,v8::Construct
    orBehavior,v8::SideEffectType)’: cannot convert argument 1 f
    rom ‘v8::Isolate *’ to ‘v8::Local<v8::Context>’ (compiling s
    ource file ..\src\sass_types\number.cpp) [G:\Users\Frank\Doc
    umenten\Websites\www.gutenberg-theme.dev.cc\wp-content\plugi
    ns\jsforwp-example-blocks\node_modules\node-sass\build\bindi
    ng.vcxproj]
    g:\users\frank\documenten\websites\www.gutenberg-theme.dev
    .cc\wp-content\plugins\jsforwp-example-blocks\node_modules\n
    an\nan.h(1034): error C2661: ‘v8::Value::ToString’: no overl
    oaded function takes 0 arguments (compiling source file ..\s
    rc\sass_types\null.cpp)c:\users\frank\.node-gyp\12.6.0\inclu
    de\node\v8.h(3358): note: see declaration of ‘v8::Object::Se
    t’ (compiling source file ..\src\sass_types\map.cpp) [G:\Use
    rs\Frank\Documenten\Websites\www.gutenberg-theme.dev.cc\wp-c
    ontent\plugins\jsforwp-example-blocks\node_modules\node-sass
    \build\binding.vcxproj]
    g:\users\frank\documenten\websites\www.gutenberg-theme.dev
    .cc\wp-content\plugins\jsforwp-example-blocks\node_modules\n
    an\nan_implementation_12_inl.h(337): error C2660: ‘v8::Strin
    gObject::New’: function does not take 1 arguments (compiling
    source file ..\src\sass_types\number.cpp) [G:\Users\Frank\D
    ocumenten\Websites\www.gutenberg-theme.dev.cc\wp-content\plu
    gins\jsforwp-example-blocks\node_modules\node-sass\build\bin
    ding.vcxproj]
    g:\users\frank\documenten\websites\www.gutenberg-theme.dev
    .cc\wp-content\plugins\jsforwp-example-blocks\node_modules\n
    an\nan_implementation_12_inl.h(337): error C2059: syntax err
    or: ‘)’ (compiling source file ..\src\sass_types\number.cpp)
    c:\users\frank\.node-gyp\12.6.0\include\node\v8.h(3412): not
    e: see declaration of ‘v8::Object::Get’ (compiling source fi
    le ..\src\sass_types\map.cpp) [G:\Users\Frank\Documenten\Web
    sites\www.gutenberg-theme.dev.cc\wp-content\plugins\jsforwp-
    example-blocks\node_modules\node-sass\build\binding.vcxproj]
    g:\users\frank\documenten\websites\www.gutenberg-theme.dev
    .cc\wp-content\plugins\jsforwp-example-blocks\node_modules\n
    an\nan_object_wrap.h(24): error C2039: ‘IsNearDeath’: is not
    a member of ‘Nan::Persistent<v8::Object,v8::NonCopyablePers
    istentTraits<T>>’ [G:\Users\Frank\Documenten\Websites\www.gu
    tenberg-theme.dev.cc\wp-content\plugins\jsforwp-example-bloc
    ks\node_modules\node-sass\build\binding.vcxproj]
    g:\users\frank\documenten\websites\www.gutenberg-theme.dev
    .cc\wp-content\plugins\jsforwp-example-blocks\node_modules\n
    an\nan_object_wrap.h(124): error C2039: ‘IsNearDeath’: is no
    t a member of ‘Nan::Persistent<v8::Object,v8::NonCopyablePer
    sistentTraits<T>>’ [G:\Users\Frank\Documenten\Websites\www.g
    utenberg-theme.dev.cc\wp-content\plugins\jsforwp-example-blo
    cks\node_modules\node-sass\build\binding.vcxproj]
    g:\users\frank\documenten\websites\www.gutenberg-theme.dev
    .cc\wp-content\plugins\jsforwp-example-blocks\node_modules\n
    an\nan_implementation_12_inl.h(103): error C2664: ‘v8::Maybe
    Local<v8::Function> v8::Function::New(v8::Local<v8::Context>
    ,v8::FunctionCallback,v8::Local<v8::Value>,int,v8::Construct
    orBehavior,v8::SideEffectType)’: cannot convert argument 1 f
    rom ‘v8::Isolate *’ to ‘v8::Local<v8::Context>’ (compiling s
    ource file ..\src\sass_types\factory.cpp) [G:\Users\Frank\Do
    cumenten\Websites\www.gutenberg-theme.dev.cc\wp-content\plug
    ins\jsforwp-example-blocks\node_modules\node-sass\build\bind
    ing.vcxproj]
    g:\users\frank\documenten\websites\www.gutenberg-theme.dev
    .cc\wp-content\plugins\jsforwp-example-blocks\node_modules\n
    an\nan_implementation_12_inl.h(337): error C2660: ‘v8::Strin
    gObject::New’: function does not take 1 arguments (compiling
    source file ..\src\sass_types\factory.cpp) [G:\Users\Frank\
    Documenten\Websites\www.gutenberg-theme.dev.cc\wp-content\pl
    ugins\jsforwp-example-blocks\node_modules\node-sass\build\bi
    nding.vcxproj]
    g:\users\frank\documenten\websites\www.gutenberg-theme.dev
    .cc\wp-content\plugins\jsforwp-example-blocks\node_modules\n
    an\nan_implementation_12_inl.h(337): error C2059: syntax err
    or: ‘)’ (compiling source file ..\src\sass_types\factory.cpp
    ) [G:\Users\Frank\Documenten\Websites\www.gutenberg-theme.de
    v.cc\wp-content\plugins\jsforwp-example-blocks\node_modules\
    node-sass\build\binding.vcxproj]
    g:\users\frank\documenten\websites\www.gutenberg-theme.dev
    .cc\wp-content\plugins\jsforwp-example-blocks\node_modules\n
    an\nan_object_wrap.h(24): error C2039: ‘IsNearDeath’: is not
    a member of ‘Nan::Persistent<v8::Object,v8::NonCopyablePers
    istentTraits<T>>’ [G:\Users\Frank\Documenten\Websites\www.gu
    tenberg-theme.dev.cc\wp-content\plugins\jsforwp-example-bloc
    ks\node_modules\node-sass\build\binding.vcxproj]
    g:\users\frank\documenten\websites\www.gutenberg-theme.dev
    .cc\wp-content\plugins\jsforwp-example-blocks\node_modules\n
    an\nan_object_wrap.h(124): error C2039: ‘IsNearDeath’: is no
    t a member of ‘Nan::Persistent<v8::Object,v8::NonCopyablePer
    sistentTraits<T>>’ [G:\Users\Frank\Documenten\Websites\www.g
    utenberg-theme.dev.cc\wp-content\plugins\jsforwp-example-blo
    cks\node_modules\node-sass\build\binding.vcxproj]
    g:\users\frank\documenten\websites\www.gutenberg-theme.dev
    .cc\wp-content\plugins\jsforwp-example-blocks\node_modules\n
    an\nan_object_wrap.h(24): error C2039: ‘IsNearDeath’: is not
    a member of ‘Nan::Persistent<v8::Object,v8::NonCopyablePers
    istentTraits<T>>’ [G:\Users\Frank\Documenten\Websites\www.gu
    tenberg-theme.dev.cc\wp-content\plugins\jsforwp-example-bloc
    ks\node_modules\node-sass\build\binding.vcxproj]
    g:\users\frank\documenten\websites\www.gutenberg-theme.dev
    .cc\wp-content\plugins\jsforwp-example-blocks\node_modules\n
    an\nan_implementation_12_inl.h(103): error C2664: ‘v8::Maybe
    Local<v8::Function> v8::Function::New(v8::Local<v8::Context>
    ,v8::FunctionCallback,v8::Local<v8::Value>,int,v8::Construct
    orBehavior,v8::SideEffectType)’: cannot convert argument 1 f
    rom ‘v8::Isolate *’ to ‘v8::Local<v8::Context>’ (compiling s
    ource file ..\src\sass_types\string.cpp) [G:\Users\Frank\Doc
    umenten\Websites\www.gutenberg-theme.dev.cc\wp-content\plugi
    ns\jsforwp-example-blocks\node_modules\node-sass\build\bindi
    ng.vcxproj]
    g:\users\frank\documenten\websites\www.gutenberg-theme.dev
    .cc\wp-content\plugins\jsforwp-example-blocks\node_modules\n
    an\nan_object_wrap.h(124): error C2039: ‘IsNearDeath’: is no
    t a member of ‘Nan::Persistent<v8::Object,v8::NonCopyablePer
    sistentTraits<T>>’ [G:\Users\Frank\Documenten\Websites\www.g
    utenberg-theme.dev.cc\wp-content\plugins\jsforwp-example-blo
    cks\node_modules\node-sass\build\binding.vcxproj]
    g:\users\frank\documenten\websites\www.gutenberg-theme.dev
    .cc\wp-content\plugins\jsforwp-example-blocks\node_modules\n
    an\nan_implementation_12_inl.h(337): error C2660: ‘v8::Strin
    gObject::New’: function does not take 1 arguments (compiling
    source file ..\src\sass_types\list.cpp) [G:\Users\Frank\Doc
    umenten\Websites\www.gutenberg-theme.dev.cc\wp-content\plugi
    ns\jsforwp-example-blocks\node_modules\node-sass\build\bindi
    ng.vcxproj]
    g:\users\frank\documenten\websites\www.gutenberg-theme.dev
    .cc\wp-content\plugins\jsforwp-example-blocks\node_modules\n
    an\nan_implementation_12_inl.h(337): error C2059: syntax err
    or: ‘)’ (compiling source file ..\src\sass_types\list.cpp) [
    G:\Users\Frank\Documenten\Websites\www.gutenberg-theme.dev.c
    c\wp-content\plugins\jsforwp-example-blocks\node_modules\nod
    e-sass\build\binding.vcxproj]
    g:\users\frank\documenten\websites\www.gutenberg-theme.dev
    .cc\wp-content\plugins\jsforwp-example-blocks\node_modules\n
    an\nan_implementation_12_inl.h(337): error C2660: ‘v8::Strin
    gObject::New’: function does not take 1 arguments (compiling
    source file ..\src\sass_types\string.cpp) [G:\Users\Frank\D
    ocumenten\Websites\www.gutenberg-theme.dev.cc\wp-content\plu
    gins\jsforwp-example-blocks\node_modules\node-sass\build\bin
    ding.vcxproj]
    g:\users\frank\documenten\websites\www.gutenberg-theme.dev
    .cc\wp-content\plugins\jsforwp-example-blocks\node_modules\n
    an\nan_implementation_12_inl.h(337): error C2059: syntax err
    or: ‘)’ (compiling source file ..\src\sass_types\string.cpp)
    [G:\Users\Frank\Documenten\Websites\www.gutenberg-theme.dev
    .cc\wp-content\plugins\jsforwp-example-blocks\node_modules\n
    ode-sass\build\binding.vcxproj]
    g:\users\frank\documenten\websites\www.gutenberg-theme.dev
    .cc\wp-content\plugins\jsforwp-example-blocks\node_modules\n
    an\nan.h(1034): error C2661: ‘v8::Value::ToString’: no overl
    oaded function takes 0 arguments (compiling source file ..\s
    rc\sass_types\list.cpp) [G:\Users\Frank\Documenten\Websites\
    http://www.gutenberg-theme.dev.cc\wp-content\plugins\jsforwp-exampl
    e-blocks\node_modules\node-sass\build\binding.vcxproj]
    g:\users\frank\documenten\websites\www.gutenberg-theme.dev
    .cc\wp-content\plugins\jsforwp-example-blocks\node_modules\n
    an\nan.h(1044): error C2664: ‘int v8::String::WriteUtf8(v8::
    Isolate *,char *,int,int *,int) const’: cannot convert argum
    ent 1 from ‘char *’ to ‘v8::Isolate *’ (compiling source fil
    e ..\src\sass_types\list.cpp) [G:\Users\Frank\Documenten\Web
    sites\www.gutenberg-theme.dev.cc\wp-content\plugins\jsforwp-
    example-blocks\node_modules\node-sass\build\binding.vcxproj]
    g:\users\frank\documenten\websites\www.gutenberg-theme.dev
    .cc\wp-content\plugins\jsforwp-example-blocks\node_modules\n
    an\nan.h(1034): error C2661: ‘v8::Value::ToString’: no overl
    oaded function takes 0 arguments (compiling source file ..\s
    rc\sass_types\string.cpp) [G:\Users\Frank\Documenten\Website
    s\www.gutenberg-theme.dev.cc\wp-content\plugins\jsforwp-exam
    ple-blocks\node_modules\node-sass\build\binding.vcxproj]
    g:\users\frank\documenten\websites\www.gutenberg-theme.dev
    .cc\wp-content\plugins\jsforwp-example-blocks\node_modules\n
    an\nan.h(1044): error C2664: ‘int v8::String::WriteUtf8(v8::
    Isolate *,char *,int,int *,int) const’: cannot convert argum
    ent 1 from ‘char *’ to ‘v8::Isolate *’ (compiling source fil
    e ..\src\sass_types\string.cpp) [G:\Users\Frank\Documenten\W
    ebsites\www.gutenberg-theme.dev.cc\wp-content\plugins\jsforw
    p-example-blocks\node_modules\node-sass\build\binding.vcxpro
    j]
    g:\users\frank\documenten\websites\www.gutenberg-theme.dev
    .cc\wp-content\plugins\jsforwp-example-blocks\node_modules\n
    an\nan_object_wrap.h(24): error C2039: ‘IsNearDeath’: is not
    a member of ‘Nan::Persistent<v8::Object,v8::NonCopyablePers
    istentTraits<T>>’ [G:\Users\Frank\Documenten\Websites\www.gu
    tenberg-theme.dev.cc\wp-content\plugins\jsforwp-example-bloc
    ks\node_modules\node-sass\build\binding.vcxproj]
    g:\users\frank\documenten\websites\www.gutenberg-theme.dev
    .cc\wp-content\plugins\jsforwp-example-blocks\node_modules\n
    an\nan_object_wrap.h(124): error C2039: ‘IsNearDeath’: is no
    t a member of ‘Nan::Persistent<v8::Object,v8::NonCopyablePer
    sistentTraits<T>>’ [G:\Users\Frank\Documenten\Websites\www.g
    utenberg-theme.dev.cc\wp-content\plugins\jsforwp-example-blo
    cks\node_modules\node-sass\build\binding.vcxproj]
    g:\users\frank\documenten\websites\www.gutenberg-theme.dev
    .cc\wp-content\plugins\jsforwp-example-blocks\node_modules\n
    an\nan_object_wrap.h(24): error C2039: ‘IsNearDeath’: is not
    a member of ‘Nan::Persistent<v8::Object,v8::NonCopyablePers
    istentTraits<T>>’ [G:\Users\Frank\Documenten\Websites\www.gu
    tenberg-theme.dev.cc\wp-content\plugins\jsforwp-example-bloc
    ks\node_modules\node-sass\build\binding.vcxproj]
    g:\users\frank\documenten\websites\www.gutenberg-theme.dev
    .cc\wp-content\plugins\jsforwp-example-blocks\node_modules\n
    an\nan_object_wrap.h(124): error C2039: ‘IsNearDeath’: is no
    t a member of ‘Nan::Persistent<v8::Object,v8::NonCopyablePer
    sistentTraits<T>>’ [G:\Users\Frank\Documenten\Websites\www.g
    utenberg-theme.dev.cc\wp-content\plugins\jsforwp-example-blo
    cks\node_modules\node-sass\build\binding.vcxproj]

    93 Warning(s)
    72 Error(s)

    Time Elapsed 00:00:35.62
    gyp ERR! build error
    gyp ERR! stack Error: C:\Program Files (x86)\Microsoft Visual Studio\2017\BuildTools\MSBuild\15.0\Bin\MSBuild.exe failed with exit code: 1
    gyp ERR! stack at ChildProcess.onExit (G:\Users\Frank\Documenten\Websites\www.gutenberg-theme.dev.cc\wp-content\plugins\jsforwp-example-blocks\node_modules\node-gyp\lib\build.js:258:23)
    gyp ERR! stack at ChildProcess.emit (events.js:203:13)
    gyp ERR! stack at Process.ChildProcess._handle.onexit (internal/child_process.js:272:12)
    gyp ERR! System Windows_NT 10.0.17134
    gyp ERR! command “C:\\Program Files\\nodejs\\node.exe” “G:\\Users\\Frank\\Documenten\\Websites\\www.gutenberg-theme.dev.cc\\wp-content\\plugins\\jsforwp-example-blocks\\node_modules\\node-gyp\\bin\\node-gyp.js” “rebuild” “–verbose” “–libsass_ext=” “–libsass_cflags=” “–libsass_ldflags=” “–libsass_library=”
    gyp ERR! cwd G:\Users\Frank\Documenten\Websites\www.gutenberg-theme.dev.cc\wp-content\plugins\jsforwp-example-blocks\node_modules\node-sass
    gyp ERR! node -v v12.6.0
    gyp ERR! node-gyp -v v3.6.2
    gyp ERR! not ok
    Build failed with error code: 1
    npm WARN jsforwp-blocks@1.0.0 No description
    npm WARN jsforwp-blocks@1.0.0 No repository field.
    npm WARN optional SKIPPING OPTIONAL DEPENDENCY: fsevents@1.1.3 (node_modules\fsevents):
    npm WARN notsup SKIPPING OPTIONAL DEPENDENCY: Unsupported platform for fsevents@1.1.3: wanted {“os”:”darwin”,”arch”:”any”} (current: {“os”:”win32″,”arch”:”x64″})

    npm ERR! code ELIFECYCLE
    npm ERR! errno 1
    npm ERR! node-sass@4.8.3 postinstall: node scripts/build.js
    at Compilation.buildModule (G:\Users\Frank\Documenten\Websites\www.gutenberg-theme.dev.cc\wp-content\plugins\jsforwp-example-blocks\node_modules\webpack\lib\Compilation.js:151:10) at G:\Users\Frank\Documenten\Websites\www.gutenberg-theme.dev.cc\wp-content\plugins\jsforwp-example-blocks\node_modules\webpack\lib\Compilation.js:454:10 at G:\Users\Frank\Documenten\Websites\www.gutenberg-theme.dev.cc\wp-content\plugins\jsforwp-example-blocks\node_modules\webpack\lib\NormalModuleFactory.js:243:5 at G:\Users\Frank\Documenten\Websites\www.gutenberg-theme.dev.cc\wp-content\plugins\jsforwp-example-blocks\node_modules\webpack\lib\NormalModuleFactory.js:94:13 at G:\Users\Frank\Documenten\Websites\www.gutenberg-theme.dev.cc\wp-content\plugins\jsforwp-example-blocks\node_modules\tapable\lib\Tapable.js:268:11 at NormalModuleFactory.<anonymous> (G:\Users\Frank\Documenten\Websites\www.gutenberg-theme.dev.cc\wp-content\plugins\jsforwp-example-blocks\node_modules\webpack\lib\CompatibilityPlugin.js:52:5)

    #114994

    Zac Gordon
    Keymaster

    Hi Frank! I just tried the following and had no issues:

    
    git clone https://github.com/zgordon/gutenberg-course.git
    cd gutenberg-course
    npm install
    

    I am looking over all the packages though to see what the issue may have been and updating some other small things as well. Will let you know what else I find!

Viewing 2 posts - 1 through 2 (of 2 total)

You must be logged in to reply to this topic.